Installation of DC10+ driver

Installation of DC10+ driver


[ Follow Ups ] [ Post Followups ] [ FAQ ]
[ Back to Messages ]

Posted by Nicolas on March 24, 2003 at 10:34:52:

Hi,

I try to install and use the zoran driver 0.8 (with DC10+ card and mandrake 9.0) but i have some problems. when i use make command i have the following result:

[root@localhost zoran-driver-0.8]# make
make: /scripts/pathdown.sh : Command not found
Pç@Pç@Making Zoran 36060+36057/67 driver for 2.4.19-16mdk kernel...DIR=`pwd`; (cd /usr/src/linux; make SUBDIRS=$DIR modules)
make[1]: Entre dans le répertoire `/usr/src/linux-2.4.19-16mdk'
make -C /home/nicolas/zoran-driver-0.8 CFLAGS="-D__KERNEL__ -I/usr/src/linux-2.4.19-16mdk/include -Wall -Wstrict-prototypes -Wno-trigraphs -O2 -fno-strict-aliasing -fno-common -fomit-frame-pointer -pipe -mpreferred-stack-boundary=2 -march=i586 -DMODULE -DMODVERSIONS -include /usr/src/linux-2.4.19-16mdk/include/linux/modversions.h" MAKING_MODULES=1 modules
make[2]: Entre dans le répertoire `/home/nicolas/zoran-driver-0.8'
gcc -D__KERNEL__ -I/usr/src/linux-2.4.19-16mdk/include -Wall -Wstrict-prototypes -Wno-trigraphs -O2 -fno-strict-aliasing -fno-common -fomit-frame-pointer -pipe -mpreferred-stack-boundary=2 -march=i586 -DMODULE -DMODVERSIONS -include /usr/src/linux-2.4.19-16mdk/include/linux/modversions.h -DEXPORT_SYMTAB -nostdinc -I /usr/lib/gcc-lib/i586-mandrake-linux-gnu/3.2/include -DKBUILD_BASENAME=zoran -c -o zoran.o zoran.c
In file included from zoran.c:57:/usr/src/linux-2.4.19-16mdk/include/linux/malloc.h:4:2: warning:
#warning linux/malloc.h is deprecated, use linux/slab.h instead.
zoran.c: In function `zr36060_reset':
zoran.c:1436: warning: deprecated use of label at end of compound statement
zoran.c: In function `zoran_reap_stat_com':
zoran.c:2574: warning: implicit declaration of function `get_fast_time'
zoran.c: In function `zoran_open':
zoran.c:3145: structure has no member named `busy'
zoran.c: At top level:
zoran.c:4121: unknown field `busy' specified in initializer
zoran.c: In function `zr36057_init':
zoran.c:4260: too few arguments to function `video_register_device_R6657eb0b'
make[2]: *** [zoran.o] Erreur 1
make[2]: Quitte le répertoire `/home/nicolas/zoran-driver-0.8'
make[1]: *** [_mod_/home/nicolas/zoran-driver-0.8] Erreur 2
make[1]: Quitte le répertoire `/usr/src/linux-2.4.19-16mdk'
make: *** [here] Erreur 2
[root@localhost zoran-driver-0.8]

#kernel used : 2.4.19

I used linux since 1 month, so i don't understand why it doesn't works.
Anyone could explain me what i must do to run this driver?
Thanks

PS : excuse my sad english...


Follow Ups:


Post a Followup

Please note:
  • Messages must be on the topic of this forum!
  • No posting of requests for cracks, codes, serials, or warez!
  • No posting of illegal software or links to such sites!
  • No use of profanity or inappropriate or offensive language!
  • Spamming is not allowed!
  • We track the IP addresses of forum abusers!
  • Abuse of this forum will be reported to your ISP!
Name:
E-Mail (optional):
please note: your e-mail address will be visible in your message.

Subject:

Comments:

Optional Link URL:
Link Title:
Optional Image URL: